{"text_format":"1","workbook":"xlsx","n_sheets":11,"sheets":["Revision Control","Flow Chart","Process Inputs","DCF Summary","Financial Analysis dms","DCF Summary Graph","Expense Graph","Depreciation Calcs","MACRS Schedule","CEMAC Standard Indicies Data","Additional Material Notes"],"not_rendered":{"charts":3,"images":1,"macros":1,"external_links":2,"defined_names":122,"comments":1,"pivot_tables":0},"unopened":[],"bounds":{"document_bytes":16777216,"sheet_cells":100000,"rows_first":2000,"rows_last":500,"rows_between":2000,"halvings":0,"cell_chars":16384,"cell_head_chars":4096},"cells_cut":0,"cells_raw":0,"read":"whole","date_system":"1900"}

{"sheet":"Revision Control","index":0,"n_rows":18,"n_cols":4,"rows_kept":18,"cut":false,"hidden":false,"merged":[]}
[]
[]
[]
[]
["Date","Author","Revision","Changes Made"]
["2015-08-01","Samantha Reese","A","Initial Model"]
{"$rows_left_out":13}
{"sheet":"Flow Chart","index":1,"n_rows":0,"n_cols":0,"rows_kept":0,"cut":false,"hidden":false,"merged":[]}

{"sheet":"Process Inputs","index":2,"n_rows":177,"n_cols":13,"rows_kept":177,"cut":false,"hidden":false,"merged":[[10,0,10,1],[2,0,2,1],[9,0,9,1],[8,0,8,1],[7,0,7,1],[6,0,6,1],[4,0,4,1],[5,0,5,1],[29,0,33,0],[35,0,39,0],[41,0,45,0],[47,0,51,0],[53,0,57,0],[59,0,63,0],[65,0,69,0],[132,0,136,0],[139,0,143,0],[146,0,150,0]]}
[null,null,"Value Used in Calculation","Base Value","Low Value","High Value",null,null,null,"Date Updated:","Notes:","Previous Date:","Previuos Value & Note"]
[]
["Country Specific Inputs"]
["Countries to be Analyzed"]
["Materials"]
[]
{"$rows_left_out":172}
{"sheet":"DCF Summary","index":3,"n_rows":103,"n_cols":27,"rows_kept":103,"cut":false,"hidden":false,"merged":[[4,3,4,7],[9,3,9,7],[20,3,20,7]]}
[null,"Input for DCF Calculation"]
[]
[]
[]
[null," ",null,"LOCATION"]
[null," ",null,{"$f":"'Process Inputs'!B21","v":1},{"$f":"'Process Inputs'!B22","v":2},{"$f":"'Process Inputs'!B23","v":3},{"$f":"'Process Inputs'!B24","v":4},{"$f":"'Process Inputs'!B25","v":5}]
{"$rows_left_out":98}
{"sheet":"Financial Analysis dms","index":4,"n_rows":267,"n_cols":33,"rows_kept":267,"cut":false,"hidden":false,"merged":[[103,0,105,0],[37,0,39,0],[37,3,39,3],[40,0,42,0],[43,0,47,0],[52,0,53,0],[54,0,57,0],[25,3,36,3],[3,0,13,0],[14,0,15,0],[17,0,19,0],[20,0,24,0],[25,0,36,0]]}
["Created by: Ran Fu, NREL (ran.fu@nrel.gov)",null,"Year"]
[null,null,0,1,2,3,4,5,6,7,8,9,10,11,12,13,14,15,16,17,18,19,20,21,22,23,24,25,26,27,28,29,30]
[null,"Model Inputs"]
["Incomes","Sales  ",{"$f":"Product_per_yr","v":1}," ","from setup page"]
[null,"Minimum sustainable price (MSP)",6346059.5136108398," "]
[null,"Sales increase rate",{"$f":"CSI_SalesIncrease","v":0},null,null,null,null,null,null,null,"Units are Million $"]
{"$rows_left_out":262}
{"sheet":"DCF Summary Graph","index":5,"n_rows":54,"n_cols":28,"rows_kept":54,"cut":false,"hidden":false,"merged":[]}
[]
[]
[]
[]
[]
[]
{"$rows_left_out":49}
{"sheet":"Expense Graph","index":6,"n_rows":24,"n_cols":22,"rows_kept":24,"cut":false,"hidden":false,"merged":[]}
["Country Analysized",{"$f":"AnalysisCountry","v":1}]
["Material",{"$f":"INDEX('DCF Summary'!$L$76:$Q$87,MATCH(A2,expensevariable,0),MATCH(AnalysisCountry,expensecountry,0))","v":162180}]
["Labor",{"$f":"INDEX('DCF Summary'!$L$76:$Q$87,MATCH(A3,expensevariable,0),MATCH(AnalysisCountry,expensecountry,0))","v":1387975}]
["Energy and Utilities",{"$f":"INDEX('DCF Summary'!$L$76:$Q$87,MATCH(A4,expensevariable,0),MATCH(AnalysisCountry,expensecountry,0))","v":261214.66899999994}]
["Equipment",{"$f":"INDEX('DCF Summary'!$L$76:$Q$87,MATCH(A5,expensevariable,0),MATCH(AnalysisCountry,expensecountry,0))","v":456676.97753815976}]
["Facilities",{"$f":"INDEX('DCF Summary'!$L$76:$Q$87,MATCH(A6,expensevariable,0),MATCH(AnalysisCountry,expensecountry,0))","v":524246.79183111532}]
{"$rows_left_out":19}
{"sheet":"Depreciation Calcs","index":7,"n_rows":47,"n_cols":47,"rows_kept":47,"cut":false,"hidden":false,"merged":[[4,1,4,3],[40,1,40,3],[1,1,1,46],[42,1,42,46]]}
[]
[null,"Equipment and Tooling Depreciation"]
[]
[null,null,null,null,null,null,null,null,null,null,null,null,null,null,null,"Depreciation Charge"]
[null,"Equipment & Tooling Summary Table",null,null,null,null,null,null,null,{"$f":"F7","v":20},"Analysis Year","Inflation Multiplier","Equipment Replacements","Depreciable Tooling",null,"Operation Year",1,2,3,4,5,6,7,8,9,10,11,12,13,14,15,16,17,18,19,20,21,22,23,24,25,26,27,28,29,30,"Remaining Value at End of Analysis Period"]
[null,"Equipment","Process Step ","Table Name","Installed Equipment Cost (USD)","Equipment Life (y)","Depreciable Tooling Cost (USD)","Depreciable Tooling Life (y)",null,{"$f":"IF(GCD($J$5,K6)=$J$5,\"replace\", \"\")","v":"replace"},0,0,{"$f":"tblI_Equipment[[#Totals],[Installed Equipment Cost (USD)]]","v":7700000},{"$f":"tblI_Equipment[[#Totals],[Depreciable Tooling Cost (USD)]]","v":0},null,null,{"$f":"$M6*INDEX(tbl_MACRS_Schedule[#Data],MATCH(Q$5,tbl_MACRS_Schedule[Years],0),MATCH(CSI_Equipment_deprec,tbl_MACRS_Schedule[#Headers],0))+$N6*INDEX(tbl_MACRS_Schedule[#Data],MATCH(Q5,tbl_MACRS_Schedule[Years],0),MATCH(CSI_Tooling_deprec,tbl_MACRS_Schedule[#Headers],0))","v":1100000},{"$f":"$M6*INDEX(tbl_MACRS_Schedule[#Data],MATCH(R$5,tbl_MACRS_Schedule[Years],0),MATCH(CSI_Equipment_deprec,tbl_MACRS_Schedule[#Headers],0))+$N6*INDEX(tbl_MACRS_Schedule[#Data],MATCH(R5,tbl_MACRS_Schedule[Years],0),MATCH(CSI_Tooling_deprec,tbl_MACRS_Schedule[#Headers],0))","v":1100000},{"$f":"$M6*INDEX(tbl_MACRS_Schedule[#Data],MATCH(S$5,tbl_MACRS_Schedule[Years],0),MATCH(CSI_Equipment_deprec,tbl_MACRS_Schedule[#Headers],0))+$N6*INDEX(tbl_MACRS_Schedule[#Data],MATCH(S5,tbl_MACRS_Schedule[Years],0),MATCH(CSI_Tooling_deprec,tbl_MACRS_Schedule[#Headers],0))","v":1100000},{"$f":"$M6*INDEX(tbl_MACRS_Schedule[#Data],MATCH(T$5,tbl_MACRS_Schedule[Years],0),MATCH(CSI_Equipment_deprec,tbl_MACRS_Schedule[#Headers],0))+$N6*INDEX(tbl_MACRS_Schedule[#Data],MATCH(T5,tbl_MACRS_Schedule[Years],0),MATCH(CSI_Tooling_deprec,tbl_MACRS_Schedule[#Headers],0))","v":1100000},{"$f":"$M6*INDEX(tbl_MACRS_Schedule[#Data],MATCH(U$5,tbl_MACRS_Schedule[Years],0),MATCH(CSI_Equipment_deprec,tbl_MACRS_Schedule[#Headers],0))+$N6*INDEX(tbl_MACRS_Schedule[#Data],MATCH(U5,tbl_MACRS_Schedule[Years],0),MATCH(CSI_Tooling_deprec,tbl_MACRS_Schedule[#Headers],0))","v":1100000},{"$f":"$M6*INDEX(tbl_MACRS_Schedule[#Data],MATCH(V$5,tbl_MACRS_Schedule[Years],0),MATCH(CSI_Equipment_deprec,tbl_MACRS_Schedule[#Headers],0))+$N6*INDEX(tbl_MACRS_Schedule[#Data],MATCH(V5,tbl_MACRS_Schedule[Years],0),MATCH(CSI_Tooling_deprec,tbl_MACRS_Schedule[#Headers],0))","v":1100000},{"$f":"$M6*INDEX(tbl_MACRS_Schedule[#Data],MATCH(W$5,tbl_MACRS_Schedule[Years],0),MATCH(CSI_Equipment_deprec,tbl_MACRS_Schedule[#Headers],0))+$N6*INDEX(tbl_MACRS_Schedule[#Data],MATCH(W5,tbl_MACRS_Schedule[Years],0),MATCH(CSI_Tooling_deprec,tbl_MACRS_Schedule[#Headers],0))","v":1100000},{"$f":"$M6*INDEX(tbl_MACRS_Schedule[#Data],MATCH(X$5,tbl_MACRS_Schedule[Years],0),MATCH(CSI_Equipment_deprec,tbl_MACRS_Schedule[#Headers],0))+$N6*INDEX(tbl_MACRS_Schedule[#Data],MATCH(X5,tbl_MACRS_Schedule[Years],0),MATCH(CSI_Tooling_deprec,tbl_MACRS_Schedule[#Headers],0))","v":0},{"$f":"$M6*INDEX(tbl_MACRS_Schedule[#Data],MATCH(Y$5,tbl_MACRS_Schedule[Years],0),MATCH(CSI_Equipment_deprec,tbl_MACRS_Schedule[#Headers],0))+$N6*INDEX(tbl_MACRS_Schedule[#Data],MATCH(Y5,tbl_MACRS_Schedule[Years],0),MATCH(CSI_Tooling_deprec,tbl_MACRS_Schedule[#Headers],0))","v":0},{"$f":"$M6*INDEX(tbl_MACRS_Schedule[#Data],MATCH(Z$5,tbl_MACRS_Schedule[Years],0),MATCH(CSI_Equipment_deprec,tbl_MACRS_Schedule[#Headers],0))+$N6*INDEX(tbl_MACRS_Schedule[#Data],MATCH(Z5,tbl_MACRS_Schedule[Years],0),MATCH(CSI_Tooling_deprec,tbl_MACRS_Schedule[#Headers],0))","v":0},{"$f":"$M6*INDEX(tbl_MACRS_Schedule[#Data],MATCH(AA$5,tbl_MACRS_Schedule[Years],0),MATCH(CSI_Equipment_deprec,tbl_MACRS_Schedule[#Headers],0))+$N6*INDEX(tbl_MACRS_Schedule[#Data],MATCH(AA5,tbl_MACRS_Schedule[Years],0),MATCH(CSI_Tooling_deprec,tbl_MACRS_Schedule[#Headers],0))","v":0},{"$f":"$M6*INDEX(tbl_MACRS_Schedule[#Data],MATCH(AB$5,tbl_MACRS_Schedule[Years],0),MATCH(CSI_Equipment_deprec,tbl_MACRS_Schedule[#Headers],0))+$N6*INDEX(tbl_MACRS_Schedule[#Data],MATCH(AB5,tbl_MACRS_Schedule[Years],0),MATCH(CSI_Tooling_deprec,tbl_MACRS_Schedule[#Headers],0))","v":0},{"$f":"$M6*INDEX(tbl_MACRS_Schedule[#Data],MATCH(AC$5,tbl_MACRS_Schedule[Years],0),MATCH(CSI_Equipment_deprec,tbl_MACRS_Schedule[#Headers],0))+$N6*INDEX(tbl_MACRS_Schedule[#Data],MATCH(AC5,tbl_MACRS_Schedule[Years],0),MATCH(CSI_Tooling_deprec,tbl_MACRS_Schedule[#Headers],0))","v":0},{"$f":"$M6*INDEX(tbl_MACRS_Schedule[#Data],MATCH(AD$5,tbl_MACRS_Schedule[Years],0),MATCH(CSI_Equipment_deprec,tbl_MACRS_Schedule[#Headers],0))+$N6*INDEX(tbl_MACRS_Schedule[#Data],MATCH(AD5,tbl_MACRS_Schedule[Years],0),MATCH(CSI_Tooling_deprec,tbl_MACRS_Schedule[#Headers],0))","v":0},{"$f":"$M6*INDEX(tbl_MACRS_Schedule[#Data],MATCH(AE$5,tbl_MACRS_Schedule[Years],0),MATCH(CSI_Equipment_deprec,tbl_MACRS_Schedule[#Headers],0))+$N6*INDEX(tbl_MACRS_Schedule[#Data],MATCH(AE5,tbl_MACRS_Schedule[Years],0),MATCH(CSI_Tooling_deprec,tbl_MACRS_Schedule[#Headers],0))","v":0},{"$f":"$M6*INDEX(tbl_MACRS_Schedule[#Data],MATCH(AF$5,tbl_MACRS_Schedule[Years],0),MATCH(CSI_Equipment_deprec,tbl_MACRS_Schedule[#Headers],0))+$N6*INDEX(tbl_MACRS_Schedule[#Data],MATCH(AF5,tbl_MACRS_Schedule[Years],0),MATCH(CSI_Tooling_deprec,tbl_MACRS_Schedule[#Headers],0))","v":0},{"$f":"$M6*INDEX(tbl_MACRS_Schedule[#Data],MATCH(AG$5,tbl_MACRS_Schedule[Years],0),MATCH(CSI_Equipment_deprec,tbl_MACRS_Schedule[#Headers],0))+$N6*INDEX(tbl_MACRS_Schedule[#Data],MATCH(AG5,tbl_MACRS_Schedule[Years],0),MATCH(CSI_Tooling_deprec,tbl_MACRS_Schedule[#Headers],0))","v":0},{"$f":"$M6*INDEX(tbl_MACRS_Schedule[#Data],MATCH(AH$5,tbl_MACRS_Schedule[Years],0),MATCH(CSI_Equipment_deprec,tbl_MACRS_Schedule[#Headers],0))+$N6*INDEX(tbl_MACRS_Schedule[#Data],MATCH(AH5,tbl_MACRS_Schedule[Years],0),MATCH(CSI_Tooling_deprec,tbl_MACRS_Schedule[#Headers],0))","v":0},{"$f":"$M6*INDEX(tbl_MACRS_Schedule[#Data],MATCH(AI$5,tbl_MACRS_Schedule[Years],0),MATCH(CSI_Equipment_deprec,tbl_MACRS_Schedule[#Headers],0))+$N6*INDEX(tbl_MACRS_Schedule[#Data],MATCH(AI5,tbl_MACRS_Schedule[Years],0),MATCH(CSI_Tooling_deprec,tbl_MACRS_Schedule[#Headers],0))","v":0},{"$f":"$M6*INDEX(tbl_MACRS_Schedule[#Data],MATCH(AJ$5,tbl_MACRS_Schedule[Years],0),MATCH(CSI_Equipment_deprec,tbl_MACRS_Schedule[#Headers],0))+$N6*INDEX(tbl_MACRS_Schedule[#Data],MATCH(AJ5,tbl_MACRS_Schedule[Years],0),MATCH(CSI_Tooling_deprec,tbl_MACRS_Schedule[#Headers],0))","v":0},{"$f":"$M6*INDEX(tbl_MACRS_Schedule[#Data],MATCH(AK$5,tbl_MACRS_Schedule[Years],0),MATCH(CSI_Equipment_deprec,tbl_MACRS_Schedule[#Headers],0))+$N6*INDEX(tbl_MACRS_Schedule[#Data],MATCH(AK5,tbl_MACRS_Schedule[Years],0),MATCH(CSI_Tooling_deprec,tbl_MACRS_Schedule[#Headers],0))","v":0},null,null,null,null,null,null,null,null,null,{"$f":"M6+N6-SUMIF(Q5:AT5,\"<=\" & CSI_analysis_yrs,Q6:AT6)","v":0}]
{"$rows_left_out":42}
{"sheet":"MACRS Schedule","index":8,"n_rows":28,"n_cols":14,"rows_kept":28,"cut":false,"hidden":false,"merged":[]}
[]
[]
[]
[null,"MODIFIED ACCELERATED COST RECOVERY SYSTEM (MACRS)"]
[]
[null,"Years","3 year MACRS","5 year MACRS","7 year MACRS","10 year MACRS","15 year MACRS","20 year MACRS","3 Year Straighline","5 Year Straighline","7 Year Straighline","10 Year Straighline","15 Year Straighline","20 Year Straightline"]
{"$rows_left_out":23}
{"sheet":"CEMAC Standard Indicies Data","index":9,"n_rows":259,"n_cols":55,"rows_kept":259,"cut":false,"hidden":false,"merged":[]}
[]
[]
[]
[]
[null,"Database File:","CEMAC Standard Indices Data December 2016_RevisionI.xlsx"]
[null,"Date Copied","2016-12-20T16:28:33"]
{"$rows_left_out":254}
{"sheet":"Additional Material Notes","index":10,"n_rows":0,"n_cols":0,"rows_kept":0,"cut":false,"hidden":false,"merged":[]}