{"text_format":"1","workbook":"xlsx","n_sheets":7,"sheets":["Input Sheet","Power Results","Direct Use Results","Cascaded Use Potential","Equation inputs+defaults","Monte Carlo Calculations","Tables"],"not_rendered":{"charts":9,"images":0,"macros":1,"external_links":1,"defined_names":106,"comments":1,"pivot_tables":0},"unopened":[],"bounds":{"document_bytes":16777216,"sheet_cells":100000,"rows_first":2000,"rows_last":500,"rows_between":2000,"halvings":0,"cell_chars":16384,"cell_head_chars":4096},"cells_cut":0,"cells_raw":0,"read":"whole","date_system":"1900"}

{"sheet":"Input Sheet","index":0,"n_rows":76,"n_cols":29,"rows_kept":76,"cut":false,"hidden":false,"merged":[[1,1,1,2],[51,2,51,3],[36,2,36,3],[23,2,23,3],[2,8,14,13]]}
["Reservoir Properties"]
["Site name:",null,null,null,null,null,null,null,"Instructions",null,null,null,null,null,null,"Distribution Types & Required Inputs",null,null,null,null,null,"Required Variables for Calculation Methods",null,null,null,null,null,null,"Disclaimer"]
[null,null,null,null,null,null,null,null,"Enter all known information to the best of your ability.\n\nUse the given information (right) to ensure that all required cells are populated for the selected distribution types and desired calculation methods.\n\nIf bedrock composition is not known, input Quartzite.\n\nDefault values are generalized estimations. Values tailored to the specifications of a system will more accurately represent a project. \n\n"]
[null,"Minimum","Most Likely/Mean","Maximum","Standard Deviation","Distribution type","Unit",null,null,null,null,null,null,null,null,null,null,null,null,null,null,"Volumetric Method",null,null,"Power Density Method",null,null,null,"These assessment tools are written for industry "]
["Area",null,null,null,null,"-","km^2",null,null,null,null,null,null,null,null,null,null,null,null,null,null,"Temperature",null,null,"Temperature",null,null,null,"professionals and are not substitutes for detailed"]
["Volume",null,null,null,null,"-","km^3",null,null,null,null,null,null,null,null,null,null,null,null,null,null,"Area & Thickness",null,null,"Area",null,null,null," feasibility and engineering studies. The estimates "]
["Thickness",null,null,null,null,"-","m",null,null,null,null,null,null,null,null,null,null,null,null,null,null,"OR",null,null,"Tectonic Setting",null,null,null,"provided by the RSAT are simplified outcomes "]
["Temperature",null,null,null,null,"-","C",null,null,null,null,null,null,null,null,null,null,null,null,null,null,"Volume",null,null,null,null,null,null,"borrowed from published methods. They are neither "]
["Total Mass Flow Rate",null,null,null,null,"-","L/s",null,null,null,null,null,null,null,null,null,null,null,null,null,null,null,null,null,null,null,null,null,"certified nor guaranteed to be accurate. The reported "]
[null,null,null,null,null,null,null,null,null,null,null,null,null,null,null,null,null,null,null,null,null,"Flow Rate Method",null,null,null,null,null,null,"results are not comparable to detailed resource"]
{"$rows_left_out":67}
{"sheet":"Power Results","index":1,"n_rows":27,"n_cols":20,"rows_kept":27,"cut":false,"hidden":false,"merged":[[0,0,0,7],[0,9,0,16],[0,18,0,25],[26,0,26,8]]}
["Volumetric Results",null,null,null,null,null,null,null,null,"Power Density Results",null,null,null,null,null,null,null,null,"Flow Rate Results"]
[]
["Mean",{"$f":"AVERAGE('Monte Carlo Calculations'!V15:V10015)","v":{"$error":"#VALUE!"}},null,null,null,null,null,null,null,"Mean",{"$f":"AVERAGE('Monte Carlo Calculations'!W15:W10015)","v":{"$error":"#VALUE!"}},null,null,null,null,null,null,null,"Mean",{"$f":"AVERAGE('Monte Carlo Calculations'!X15:X10015)","v":{"$error":"#VALUE!"}}]
["P90",{"$f":"_xlfn.PERCENTILE.INC([0]!vol_power_results,0.1)","v":{"$error":"#VALUE!"}},null,null,null,null,null,null,null,"P90",{"$f":"_xlfn.PERCENTILE.INC([0]!pow_dens_results,0.1)","v":{"$error":"#VALUE!"}},null,null,null,null,null,null,null,"P90",{"$f":"_xlfn.PERCENTILE.INC([0]!flow_power_results,0.1)","v":{"$error":"#VALUE!"}}]
["P50",{"$f":"_xlfn.PERCENTILE.INC([0]!vol_power_results,0.5)","v":{"$error":"#VALUE!"}},null,null,null,null,null,null,null,"P50",{"$f":"_xlfn.PERCENTILE.INC([0]!pow_dens_results,0.5)","v":{"$error":"#VALUE!"}},null,null,null,null,null,null,null,"P50",{"$f":"_xlfn.PERCENTILE.INC([0]!flow_power_results,0.5)","v":{"$error":"#VALUE!"}}]
["P10",{"$f":"_xlfn.PERCENTILE.INC([0]!vol_power_results,0.9)","v":{"$error":"#VALUE!"}},null,null,null,null,null,null,null,"P10",{"$f":"_xlfn.PERCENTILE.INC([0]!pow_dens_results,0.9)","v":{"$error":"#VALUE!"}},null,null,null,null,null,null,null,"P10",{"$f":"_xlfn.PERCENTILE.INC([0]!flow_power_results,0.9)","v":{"$error":"#VALUE!"}}]
[]
[]
[]
[]
{"$rows_left_out":18}
{"sheet":"Direct Use Results","index":2,"n_rows":27,"n_cols":11,"rows_kept":27,"cut":false,"hidden":false,"merged":[[0,0,0,7],[0,9,0,16],[26,0,26,8]]}
["Volumetric Results",null,null,null,null,null,null,null,null,"Flow Rate Results"]
[]
["Mean",{"$f":"AVERAGE([0]!vol_DU_results)","v":{"$error":"#VALUE!"}},null,null,null,null,null,null,null,"Mean",{"$f":"AVERAGE([0]!flow_DU_results)","v":{"$error":"#VALUE!"}}]
["P90",{"$f":"_xlfn.PERCENTILE.INC([0]!vol_DU_results,0.1)","v":{"$error":"#VALUE!"}},null,null,null,null,null,null,null,"P90",{"$f":"_xlfn.PERCENTILE.INC([0]!flow_DU_results,0.1)","v":{"$error":"#VALUE!"}}]
["P50",{"$f":"_xlfn.PERCENTILE.INC([0]!vol_DU_results,0.5)","v":{"$error":"#VALUE!"}},null,null,null,null,null,null,null,"P50",{"$f":"_xlfn.PERCENTILE.INC([0]!flow_DU_results,0.5)","v":{"$error":"#VALUE!"}}]
["P10",{"$f":"_xlfn.PERCENTILE.INC([0]!vol_DU_results,0.9)","v":{"$error":"#VALUE!"}},null,null,null,null,null,null,null,"P10",{"$f":"_xlfn.PERCENTILE.INC([0]!flow_DU_results,0.9)","v":{"$error":"#VALUE!"}}]
[]
[]
[]
[]
{"$rows_left_out":18}
{"sheet":"Cascaded Use Potential","index":3,"n_rows":7,"n_cols":9,"rows_kept":7,"cut":false,"hidden":false,"merged":[[2,1,2,3],[2,6,2,8]]}
["Resource Size Potential for Cascaded Use Project "]
[]
[null,"Volumetric Method",null,null,null,null,"Flow Rate Method"]
[null,"Power (MWe)","Direct Use (MWt)","Difference (Cascaded Use) (MWt)",null,null,"Power (MWe)","Direct Use (MWt)","Difference (Cascaded Use) (MWt)"]
["P90",{"$f":"_xlfn.PERCENTILE.INC('Monte Carlo Calculations'!V12:V10012,0.1)","v":{"$error":"#VALUE!"}},{"$f":"_xlfn.PERCENTILE.INC([0]!vol_DU_results,0.1)","v":{"$error":"#VALUE!"}},{"$f":"C5-B5","v":{"$error":"#VALUE!"}},null,"P90",{"$f":"_xlfn.PERCENTILE.INC('Monte Carlo Calculations'!X12:X10012,0.1)","v":{"$error":"#VALUE!"}},{"$f":"_xlfn.PERCENTILE.INC([0]!flow_DU_results,0.1)","v":{"$error":"#VALUE!"}},{"$f":"H5-G5","v":{"$error":"#VALUE!"}}]
["P50",{"$f":"_xlfn.PERCENTILE.INC('Monte Carlo Calculations'!V13:V10013,0.5)","v":{"$error":"#VALUE!"}},{"$f":"_xlfn.PERCENTILE.INC([0]!vol_DU_results,0.5)","v":{"$error":"#VALUE!"}},{"$f":"C6-B6","v":{"$error":"#VALUE!"}},null,"P50",{"$f":"_xlfn.PERCENTILE.INC('Monte Carlo Calculations'!X13:X10013,0.5)","v":{"$error":"#VALUE!"}},{"$f":"_xlfn.PERCENTILE.INC([0]!flow_DU_results,0.5)","v":{"$error":"#VALUE!"}},{"$f":"H6-G6","v":{"$error":"#VALUE!"}}]
["P10",{"$f":"_xlfn.PERCENTILE.INC('Monte Carlo Calculations'!V14:V10014,0.9)","v":{"$error":"#VALUE!"}},{"$f":"_xlfn.PERCENTILE.INC([0]!vol_DU_results,0.9)","v":{"$error":"#VALUE!"}},{"$f":"C7-B7","v":{"$error":"#VALUE!"}},null,"P10",{"$f":"_xlfn.PERCENTILE.INC('Monte Carlo Calculations'!X14:X10014,0.9)","v":{"$error":"#VALUE!"}},{"$f":"_xlfn.PERCENTILE.INC([0]!flow_DU_results,0.9)","v":{"$error":"#VALUE!"}},{"$f":"H7-G7","v":{"$error":"#VALUE!"}}]

{"sheet":"Equation inputs+defaults","index":4,"n_rows":20,"n_cols":7,"rows_kept":20,"cut":false,"hidden":false,"merged":[]}
["Input Sheet"]
["Reservoir_Properties","Units","Min","Most_Likely","Max","Standar_Desviation","Distribution_Type"]
["ReservoirArea","km2",{"$f":"'Input Sheet'!B5","v":0},{"$f":"'Input Sheet'!C5","v":0},{"$f":"'Input Sheet'!D5","v":0},{"$f":"'Input Sheet'!E5","v":0},{"$f":"IF('Input Sheet'!F5=\"Triangular\",\"T\",IF('Input Sheet'!F5=\"Constant\",\"C\",IF('Input Sheet'!F5=\"Uniform\",\"U\",IF('Input Sheet'!F5=\"Normal\",\"N\",IF('Input Sheet'!F5=\"Lognormal\",\"L\",\"No distribution selected.\")))))","v":"No distribution selected."}]
["Thickness","m",{"$f":"'Input Sheet'!B7","v":0},{"$f":"'Input Sheet'!C7","v":0},{"$f":"'Input Sheet'!D7","v":0},{"$f":"'Input Sheet'!E7","v":0},{"$f":"IF('Input Sheet'!F7=\"Triangular\",\"T\",IF('Input Sheet'!F7=\"Constant\",\"C\",IF('Input Sheet'!F7=\"Uniform\",\"U\",IF('Input Sheet'!F7=\"Normal\",\"N\",IF('Input Sheet'!F7=\"Lognormal\",\"L\",\"No distribution selected.\")))))","v":"No distribution selected."}]
["Volume","km3",{"$f":"'Input Sheet'!B6","v":0},{"$f":"'Input Sheet'!C6","v":0},{"$f":"'Input Sheet'!D6","v":0},{"$f":"'Input Sheet'!E6","v":0},{"$f":"IF('Input Sheet'!F6=\"Triangular\",\"T\",IF('Input Sheet'!F6=\"Constant\",\"C\",IF('Input Sheet'!F6=\"Uniform\",\"U\",IF('Input Sheet'!F6=\"Normal\",\"N\",IF('Input Sheet'!F6=\"Lognormal\",\"L\",\"No distribution selected.\")))))","v":"No distribution selected."}]
["ReservoirTemperature","oC",{"$f":"'Input Sheet'!B8","v":0},{"$f":"'Input Sheet'!C8","v":0},{"$f":"'Input Sheet'!D8","v":0},{"$f":"'Input Sheet'!E8","v":0},{"$f":"IF('Input Sheet'!F8=\"Triangular\",\"T\",IF('Input Sheet'!F8=\"Constant\",\"C\",IF('Input Sheet'!F8=\"Uniform\",\"U\",IF('Input Sheet'!F8=\"Normal\",\"N\",IF('Input Sheet'!F8=\"Lognormal\",\"L\",\"No distribution selected.\")))))","v":"No distribution selected."}]
["AbandonTemperature","oC",0,{"$f":"IF(ISBLANK('Input Sheet'!C33),'Input Sheet'!B33,'Input Sheet'!C33)","v":70},0,0,{"$f":"IF('Input Sheet'!F30=\"-\", \"C\", IF('Input Sheet'!F30=\"Triangular\",\"T\",IF('Input Sheet'!F30=\"Constant\",\"C\",IF('Input Sheet'!F30=\"Uniform\",\"U\",IF('Input Sheet'!F30=\"Normal\",\"N\",IF('Input Sheet'!F30=\"Lognormal\",\"L\",\"C\"))))))","v":"C"}]
["Porosity","%",0,{"$f":"IF('Input Sheet'!B11=Tables!A122,0.3,0.06)","v":0.06},0,0.02,"N"]
["RockSpecificHeat","kJ/kg-oC",{"$f":"VLOOKUP('Input Sheet'!B$11,Tables!A$46:D$60,3,FALSE)","v":0.97},{"$f":"VLOOKUP('Input Sheet'!B11,Tables!A46:D60,2,FALSE)","v":1.07},{"$f":"VLOOKUP('Input Sheet'!B11,Tables!A46:D60,4,FALSE)","v":1.17},null,"T"]
["WaterSpecificHeat ","kJ/kg-oC",0,{"$f":"VLOOKUP('Input Sheet'!C8,Tables!A64:B104,2,TRUE)","v":{"$error":"#N/A"}},0,null,"C"]
{"$rows_left_out":11}
{"sheet":"Monte Carlo Calculations","index":5,"n_rows":2014,"n_cols":27,"rows_kept":2014,"cut":false,"hidden":false,"merged":[]}
["Random numbers for use in distribution (minimize these)",null,null,null,null,null,null,null,null,null,null,null,null,null,null,null,null,null,null,"Volumetric: Qr+w","DU: Qr+w (accessible resource base)","Volumetric: P","Power Density","Power using flow rate","DU: Resource (with factors)","DU: Beneficial heat using Flow rate ","Total MW available "]
[1,{"$f":"+INDEX(B$15:B$10015,newrun,0)","v":"Input parameters incomplete"},{"$f":"+INDEX(C$15:C$10015,newrun,0)","v":"Input parameters incomplete"},{"$f":"+INDEX(D$15:D$10015,newrun,0)","v":"Input parameters incomplete"},{"$f":"+INDEX(E$15:E$10015,newrun,0)","v":"Input parameters incomplete"},{"$f":"+INDEX(F$15:F$10015,newrun,0)","v":105.36},{"$f":"+INDEX(G$15:G$10015,newrun,0)","v":6.1003335409113277E-2},{"$f":"+INDEX(H$15:H$10015,newrun,0)","v":1.0340369962414819},{"$f":"+INDEX(I$15:I$10015,newrun,0)","v":5.65},{"$f":"+INDEX(J$15:J$10015,newrun,0)","v":2600},{"$f":"+INDEX(K$15:K$10015,newrun,0)","v":714},{"$f":"+INDEX(L$15:L$10015,newrun,0)","v":0.1508603232115458},{"$f":"+INDEX(M$15:M$10015,newrun,0)","v":0.08},{"$f":"+INDEX(N$15:N$10015,newrun,0)","v":0.95224743315440108},{"$f":"+INDEX(O$15:O$10015,newrun,0)","v":30},{"$f":"+INDEX(P$15:P$10015,newrun,0)","v":0.46862065997852564},{"$f":"+INDEX(Q$15:Q$10015,newrun,0)","v":0.76046807321040411},{"$f":"+INDEX(R$15:R$10015,newrun,0)","v":0},"Model-->",{"$f":"IF(D12=0, (('Monte Carlo Calculations'!J2*'Monte Carlo Calculations'!H2*(1-'Monte Carlo Calculations'!G2)+'Monte Carlo Calculations'!K2*'Monte Carlo Calculations'!I2*'Monte Carlo Calculations'!G2)*('Monte Carlo Calculations'!B2*1000000)*'Monte Carlo Calculations'!C2*('Monte Carlo Calculations'!E2-'Monte Carlo Calculations'!F2)), (('Monte Carlo Calculations'!J2*'Monte Carlo Calculations'!H2*(1-'Monte Carlo Calculations'!G2)+'Monte Carlo Calculations'!K2*'Monte Carlo Calculations'!I2*'Monte Carlo Calculations'!G2)*('Monte Carlo Calculations'!D2*1000000000)*('Monte Carlo Calculations'!E2-'Monte Carlo Calculations'!F2)))","v":{"$error":"#VALUE!"}},{"$f":"IF(D12=0, (('Monte Carlo Calculations'!J2*'Monte Carlo Calculations'!H2*(1-'Monte Carlo Calculations'!G2)+'Monte Carlo Calculations'!K2*'Monte Carlo Calculations'!I2*'Monte Carlo Calculations'!G2)*('Monte Carlo Calculations'!B2*1000000)*'Monte Carlo Calculations'!C2*('Monte Carlo Calculations'!E2-S9)), (('Monte Carlo Calculations'!J2*'Monte Carlo Calculations'!H2*(1-'Monte Carlo Calculations'!G2)+'Monte Carlo Calculations'!K2*'Monte Carlo Calculations'!I2*'Monte Carlo Calculations'!G2)*('Monte Carlo Calculations'!D2*1000000000)*('Monte Carlo Calculations'!E2-S9)))","v":{"$error":"#VALUE!"}},{"$f":"((T2*L2*M2)/(N2*O2*31540000000))","v":{"$error":"#VALUE!"}},{"$f":"IF('Input Sheet'!B12=\"Primarily compressional Arc-volcanic setting\",9.7*B2,(0.0484*EXP(0.0144*E2)*B2))","v":{"$error":"#VALUE!"}},{"$f":"(R2*(E2-F2)*I2*1000*M2*K2)/(N2*10^9)","v":{"$error":"#VALUE!"}},{"$f":"((U2*L2*Q2)/(P2*O2*31540000000))","v":{"$error":"#VALUE!"}},{"$f":"(R2*(E2-S9)*I2*Q2*K2)/(P2*10^9)","v":{"$error":"#VALUE!"}},{"$f":"((U2*L2)/(O2*31540000000))","v":{"$error":"#VALUE!"}}]
["↑ cell above is named \"CurrentRun\" to use in VBA ↑"]
["iterations",{"$f":"'Input Sheet'!B14","v":1000}]
[]
[null,"Area","Thickness","Volume","Reservoir Temperature","Abandonment Temperature","Porosity","Rock Specific Heat","Water Specific Heat","Rock Density","Water Density","Recovery Factor","Conversion Efficiency","Power Factor","Life Span","Capacity/utilization/load Factor - DU/Cascaded","Heat exchange efficiency","Flow Rate","Reference Temp"]
["Range of triangular distribution",{"$f":"+RAND()","v":0.14405426406695387},{"$f":"+RAND()","v":0.97820961183364752},0.33133332484968536,0.43104137977362744,0.17151214390698943,0.91028724102933534,0.12178385660837177,0.88052924542974964,0.63933090533187975,1.0610191860840446E-2,0.13830853678662047,0.17978311206076136,2.5320984722160267E-2,0.86448318441169558,0.93919483494368983,0.92295236057439234,0.37818810253242185]
["Min",{"$f":"'Equation inputs+defaults'!C3","v":0},{"$f":"'Equation inputs+defaults'!C4","v":0},{"$f":"'Equation inputs+defaults'!C5","v":0},{"$f":"'Equation inputs+defaults'!C6","v":0},{"$f":"'Equation inputs+defaults'!C7","v":0},{"$f":"'Equation inputs+defaults'!C8","v":0},{"$f":"'Equation inputs+defaults'!C9","v":0.97},{"$f":"'Equation inputs+defaults'!C10","v":0},{"$f":"'Equation inputs+defaults'!C11","v":0},{"$f":"'Equation inputs+defaults'!C12","v":0},{"$f":"'Equation inputs+defaults'!C13","v":0.08},{"$f":"'Equation inputs+defaults'!C14","v":"-"},{"$f":"'Equation inputs+defaults'!C15","v":0.9},{"$f":"'Equation inputs+defaults'!C16","v":0},{"$f":"'Equation inputs+defaults'!C17","v":0.4},{"$f":"'Equation inputs+defaults'!C18","v":0.6},{"$f":"'Equation inputs+defaults'!C20","v":0}]
["Mean",{"$f":"'Equation inputs+defaults'!D3","v":0},{"$f":"'Equation inputs+defaults'!D4","v":0},{"$f":"'Equation inputs+defaults'!D5","v":0},{"$f":"'Equation inputs+defaults'!D6","v":0},{"$f":"'Equation inputs+defaults'!D7","v":70},{"$f":"'Equation inputs+defaults'!D8","v":0.06},{"$f":"'Equation inputs+defaults'!D9","v":1.07},{"$f":"'Equation inputs+defaults'!D10","v":{"$error":"#N/A"}},{"$f":"'Equation inputs+defaults'!D11","v":2600},{"$f":"'Equation inputs+defaults'!D12","v":{"$error":"#N/A"}},{"$f":"'Equation inputs+defaults'!D13","v":0.14000000000000001},{"$f":"'Equation inputs+defaults'!D14","v":0.08},{"$f":"'Equation inputs+defaults'!D15","v":0.95},{"$f":"'Equation inputs+defaults'!D16","v":30},{"$f":"'Equation inputs+defaults'!D17","v":0.48},{"$f":"'Equation inputs+defaults'!D18","v":0.7},{"$f":"'Equation inputs+defaults'!D20","v":0},{"$f":"IF(ISBLANK('Input Sheet'!C46),'Input Sheet'!B46,'Input Sheet'!C46)","v":15}]
["Max",{"$f":"'Equation inputs+defaults'!E3","v":0},{"$f":"'Equation inputs+defaults'!E4","v":0},{"$f":"'Equation inputs+defaults'!E5","v":0},{"$f":"'Equation inputs+defaults'!E6","v":0},{"$f":"'Equation inputs+defaults'!E7","v":0},{"$f":"'Equation inputs+defaults'!E8","v":0},{"$f":"'Equation inputs+defaults'!E9","v":1.17},{"$f":"'Equation inputs+defaults'!E10","v":0},{"$f":"'Equation inputs+defaults'!E11","v":0},{"$f":"'Equation inputs+defaults'!E12","v":0},{"$f":"'Equation inputs+defaults'!E13","v":0.2},{"$f":"'Equation inputs+defaults'!E14","v":"-"},{"$f":"'Equation inputs+defaults'!E15","v":1},{"$f":"'Equation inputs+defaults'!E16","v":0},{"$f":"'Equation inputs+defaults'!E17","v":0.5},{"$f":"'Equation inputs+defaults'!E18","v":0.8},{"$f":"'Equation inputs+defaults'!E20","v":0}]
{"$rows_left_out":2005}
{"sheet":"Tables","index":6,"n_rows":207,"n_cols":5,"rows_kept":207,"cut":false,"hidden":false,"merged":[]}
["Resource Size Indices"]
["This worksheet provides data to other worksheets - do not make edits to this worksheet"]
[]
["Temperature",null,"Water saturation pressure",null,"Source"]
[null,"bar","[kPa], [100*bar]","[atm]","[psi]"]
[0.01,{"$f":"C6/100","v":6.1165000000000004E-3},0.61165000000000003,6.0000000000000001E-3,8.8711999999999999E-2]
[2,7.0599E-3,0.70599000000000001,7.0000000000000001E-3,0.1024]
[4,8.1355000000000004E-3,0.81355,8.0000000000000002E-3,0.11799999999999999]
[10,1.2282E-2,1.2282,1.21E-2,0.17813999999999999]
[14,1.5990000000000001E-2,1.599,1.5800000000000002E-2,0.23191999999999999]
{"$rows_left_out":197}